Create Camera Calibration UI

Description

None

Activity

Show:
Stephen Marquard
March 18, 2016, 12:12 PM

lecturesight-setup-ui module is not currently in the base pom.xml, and also adding it causes a build failure:

[ERROR] Failed to execute goal org.apache.maven.plugins:maven-compiler-plugin:2.3.2:compile (default-compile) on project lecturesight-setup-ui: Compilation failure: Compilation failure:
[ERROR] /Users/ltteam/ls-bwulff/src/modules/lecturesight-setup-ui/src/main/java/cv/lecturesight/setup/CameraCalibrationUI.java:[81,20] error: cannot find symbol
[ERROR] variable steeringWorker of type CameraSteeringWorker
[ERROR] /Users/ltteam/ls-bwulff/src/modules/lecturesight-setup-ui/src/main/java/cv/lecturesight/setup/CameraCalibrationUI.java:[112,20] error: cannot find symbol
[ERROR] -> [Help 1]

Stephen Marquard
March 18, 2016, 2:58 PM
Stephen Marquard
March 18, 2016, 5:21 PM

Some failures building the CL code:

2016-03-18 19:18:17.450 DEBUG CM Configuration Updater (Update: pid=org.apache.felix.fileinstall.e5ebccfb-f7ba-41db-92f6-76be37498b18) Activator.getService() : Creating new OpenCLService instance for cv.lecturesight.setup

2016-03-18 19:18:17.450 INFO CM Configuration Updater (Update: pid=org.apache.felix.fileinstall.e5ebccfb-f7ba-41db-92f6-76be37498b18) Activator.buildPrograms() : Compiling: bundle://40.0:0/opencl/visual.cl

2016-03-18 19:18:17.791 WARNING CM Configuration Updater (Update: pid=org.apache.felix.fileinstall.e5ebccfb-f7ba-41db-92f6-76be37498b18) Activator.buildPrograms() : Could not build visual

Compilation failure : CL_BUILD_PROGRAM_FAILURE
<kernel>:18:39: warning: expression result unused
int adr = ENCODE_INDEX((int2)(pos.x+1, pos.y+1));
~~~~^
<kernel>:3:27: note: expanded from macro 'ENCODE_INDEX'
#define ENCODE_INDEX(pos) pos.x + pos.y * (width+2)
^
<kernel>:18:14: error: member reference base type 'int' is not a structure or union
int adr = ENCODE_INDEX((int2)(pos.x+1, pos.y+1));
^~~~~~~~~~~~~~~~~~~~~~~~~~~~~~~~~~~~~~
<kernel>:3:30: note: expanded from macro 'ENCODE_INDEX'
#define ENCODE_INDEX(pos) pos.x + pos.y * (width+2)
^~
<kernel>:18:39: warning: expression result unused
int adr = ENCODE_INDEX((int2)(pos.x+1, pos.y+1));
~~~~^
<kernel>:3:35: note: expanded from macro 'ENCODE_INDEX'
#define ENCODE_INDEX(pos) pos.x + pos.y * (width+2)
^
<kernel>:18:14: error: member reference base type 'int' is not a structure or union
int adr = ENCODE_INDEX((int2)(pos.x+1, pos.y+1));
^~~~~~~~~~~~~~~~~~~~~~~~~~~~~~~~~~~~~~
<kernel>:3:38: note: expanded from macro 'ENCODE_INDEX'
#define ENCODE_INDEX(pos) pos.x + pos.y * (width+2)
^~

James Perrin
November 23, 2017, 4:49 PM

I've fix the build issues in

Assignee

Benjamin Wulff

Reporter

Benjamin Wulff

Time tracking

8h

Components

Fix versions

Affects versions

Priority

Major
Configure