Standalone ingest server can't be built

Steps to reproduce

I downloaded MH 1.5.0 RC4 and built a distributed setup.

When building a standalone ingest server with
cd /opt/matterhorn_test/felix/
export MAVEN_OPTS='-Xms256m -Xmx1280m -XXermSize=64m -XX:MaxPermSize=512m'
mvn clean install -DdeployTo=/opt/matterhorn_test/felix/ -Pingest-standalone -DskipTests=true

there was a build error with the following maven output:

[INFO] ------------------------------------------------------------------------
[INFO] Building matterhorn-ingest-service-impl 1.5.0-SNAPSHOT
[INFO] ------------------------------------------------------------------------
[WARNING] The POM for org.opencastproject:matterhorn-authorization-xacml:jar:1.5.0-SNAPSHOT is missing, no dependency information available
[INFO] ------------------------------------------------------------------------
[INFO] Reactor Summary:
[INFO]
[INFO] matterhorn ........................................ SUCCESS [2.715s]
[INFO] matterhorn-json ................................... SUCCESS [6.509s]
[INFO] matterhorn-common ................................. SUCCESS [22.781s]
[INFO] matterhorn-db ..................................... SUCCESS [3.565s]
[INFO] matterhorn-metadata-api ........................... SUCCESS [2.291s]
[INFO] matterhorn-workspace-api .......................... SUCCESS [1.749s]
[INFO] matterhorn-dublincore ............................. SUCCESS [3.861s]
[INFO] matterhorn-workflow-service-api ................... SUCCESS [3.389s]
[INFO] matterhorn-ingest-service-api ..................... SUCCESS [1.373s]
[INFO] matterhorn-scheduler-api .......................... SUCCESS [2.886s]
[INFO] matterhorn-working-file-repository-service-api .... SUCCESS [2.355s]
[INFO] matterhorn-series-service-api ..................... SUCCESS [1.996s]
[INFO] matterhorn-ingest-service-impl .................... FAILURE [0.134s]
[INFO] matterhorn-kernel ................................. SKIPPED
[INFO] matterhorn-scheduler-remote ....................... SKIPPED
[INFO] matterhorn-series-service-remote .................. SKIPPED
[INFO] matterhorn-serviceregistry ........................ SKIPPED
[INFO] matterhorn-mpeg7 .................................. SKIPPED
[INFO] matterhorn-runtime-dependencies ................... SKIPPED
[INFO] matterhorn-runtime-info-ui ........................ SKIPPED
[INFO] matterhorn-userdirectory .......................... SKIPPED
[INFO] matterhorn-webconsole ............................. SKIPPED
[INFO] matterhorn-workflow-service-remote ................ SKIPPED
[INFO] matterhorn-working-file-repository-service-impl ... SKIPPED
[INFO] matterhorn-workspace-impl ......................... SKIPPED
[INFO] ------------------------------------------------------------------------
[INFO] BUILD FAILURE
[INFO] ------------------------------------------------------------------------
[INFO] Total time: 56.969s
[INFO] Finished at: Tue Jul 22 12:03:29 CEST 2014
[INFO] Final Memory: 122M/626M
[INFO] ------------------------------------------------------------------------
[ERROR] Failed to execute goal on project matterhorn-ingest-service-impl: Could not resolve dependencies for project org.opencastproject:matterhorn-ingest-service-impl:bundle:1.5.0-SNAPSHOT: Failure to find org.opencastproject:matterhorn-authorization-xacml:jar:1.5.0-SNAPSHOT in http://repository.opencastproject.org/nexus/content/groups/public-snapshots was cached in the local repository, resolution will not be reattempted until the update interval of opencast.snapshots has elapsed or updates are forced -> [Help 1]
[ERROR]
[ERROR] To see the full stack trace of the errors, re-run Maven with the -e switch.
[ERROR] Re-run Maven using the -X switch to enable full debug logging.
[ERROR]
[ERROR] For more information about the errors and possible solutions, please read the following articles:
[ERROR] [Help 1] http://cwiki.apache.org/confluence/display/MAVEN/DependencyResolutionException
[ERROR]
[ERROR] After correcting the problems, you can resume the build with the command
[ERROR] mvn <goals> -rf :matterhorn-ingest-service-impl

Status

Assignee

Greg Logan

Reporter

Alexander Bias

Severity

Build Error

Tags (folksonomy)

None

Components

Fix versions

Affects versions

1.5.0

Priority

Blocker
Configure