Uploaded image for project: 'Opencast'
  1. MH-9052

Compilation failure, incompatible types when building 1.4-rc2 capture agent against Ubuntu 10.10

    Details

    • Type: Bug
    • Status: Resolved
    • Priority: Blocker
    • Resolution: Fixed and reviewed
    • Affects versions: 1.4.0
    • Fix versions: 1.4.0
    • Components: Legacy
    • Labels:
      None
    • Severity:
      Non Functioning
    • Steps to reproduce:
      Hide
      Steps to reproduce:
      1. Compile 1.4-rc2 capture agent against Ubuntu 10.10

       
       Actual Results:
       
      INFO] -------------------------------------------------------------
      [ERROR] COMPILATION ERROR :
      [INFO] -------------------------------------------------------------
      [ERROR] /opt/matterhorn/felix/modules/matterhorn-common/src/main/java/org/opencastproject/util/data/Collections.java:[481,47] incompatible types
      found : java.util.List<java.lang.Object>
      required: java.util.List<B>
      [ERROR] /opt/matterhorn/felix/modules/matterhorn-common/src/main/java/org/opencastproject/util/data/functions/Functions.java:[241,38] incompatible types
      found : java.util.List<java.lang.Object>
      required: java.util.List<B>
      [INFO] 2 errors
      [INFO] -------------------------------------------------------------
      [INFO] ------------------------------------------------------------------------
      [ERROR] BUILD FAILURE
      [INFO] ------------------------------------------------------------------------
      [INFO] Compilation failure
       
       Expected Results:

      No build error.
       
       
       Workaround (if any):
       




      Show
      Steps to reproduce: 1. Compile 1.4-rc2 capture agent against Ubuntu 10.10    Actual Results:   INFO] ------------------------------------------------------------- [ERROR] COMPILATION ERROR : [INFO] ------------------------------------------------------------- [ERROR] /opt/matterhorn/felix/modules/matterhorn-common/src/main/java/org/opencastproject/util/data/Collections.java:[481,47] incompatible types found : java.util.List<java.lang.Object> required: java.util.List<B> [ERROR] /opt/matterhorn/felix/modules/matterhorn-common/src/main/java/org/opencastproject/util/data/functions/Functions.java:[241,38] incompatible types found : java.util.List<java.lang.Object> required: java.util.List<B> [INFO] 2 errors [INFO] ------------------------------------------------------------- [INFO] ------------------------------------------------------------------------ [ERROR] BUILD FAILURE [INFO] ------------------------------------------------------------------------ [INFO] Compilation failure    Expected Results: No build error.      Workaround (if any):  
    • Tags (folksonomy):

      TestRail: Results

        Attachments

          Issue links

            Activity

              People

              • Assignee:
                greg_logan Greg Logan
                Reporter:
                kevin@media.berkeley.edu Kevin CHAN
              • Watchers:
                0 Start watching this issue

                Dates

                • Created:
                  Updated:
                  Resolved:

                  TestRail: Cases