capture agent 1.4-rc4 install fails on ubuntu 10.04

Steps to reproduce

On ubuntu 10.04 the following error shows up when I attempt to compile the 1.4-rc4 capture agent.

-------------------------------------------------------
T E S T S
-------------------------------------------------------
Running org.opencastproject.capture.pipeline.bins.consumers.AudioFilesinkConsumerTest
log4j:WARN No appenders could be found for logger (org.opencastproject.capture.pipeline.bins.PartialBin).
log4j:WARN Please initialize the log4j system properly.
log4j:WARN See http://logging.apache.org/log4j/1.2/faq.html#noconfig for more info.
Tests run: 8, Failures: 0, Errors: 0, Skipped: 0, Time elapsed: 0.415 sec
Running org.opencastproject.capture.endpoint.CaptureRestServiceTest
Tests run: 1, Failures: 0, Errors: 0, Skipped: 1, Time elapsed: 0.004 sec
Running org.opencastproject.capture.impl.GStreamerCaptureTest
Tests run: 2, Failures: 0, Errors: 0, Skipped: 0, Time elapsed: 0.147 sec
Running org.opencastproject.capture.pipeline.bins.consumers.CustomConsumerTest
Tests run: 4, Failures: 0, Errors: 0, Skipped: 0, Time elapsed: 0.024 sec
Running org.opencastproject.capture.impl.StateServiceImplTest
Tests run: 4, Failures: 0, Errors: 0, Skipped: 0, Time elapsed: 0.175 sec
Running org.opencastproject.capture.pipeline.bins.producers.CustomVideoProducerTest

(unknown:19048): GStreamer-CRITICAL **: gst_parse_bin_from_description_full: assertion `bin_description != NULL' failed
Tests run: 4, Failures: 0, Errors: 0, Skipped: 0, Time elapsed: 0.007 sec
Running org.opencastproject.capture.impl.jobs.AgentStateJobTest
Tests run: 1, Failures: 0, Errors: 0, Skipped: 1, Time elapsed: 0.002 sec
Running org.opencastproject.capture.impl.jobs.IngestJobTest
Tests run: 6, Failures: 0, Errors: 0, Skipped: 0, Time elapsed: 11.294 sec
Running org.opencastproject.capture.pipeline.bins.producers.ProducerFactoryTest
Tests run: 1, Failures: 0, Errors: 0, Skipped: 1, Time elapsed: 0.002 sec
Running org.opencastproject.capture.impl.CaptureAgentImplTest
Waiting 5 seconds to make sure the scheduler has time to load...
Tests run: 7, Failures: 0, Errors: 0, Skipped: 0, Time elapsed: 48.808 sec
Running org.opencastproject.capture.pipeline.bins.CaptureDeviceBinTest
Tests run: 12, Failures: 0, Errors: 0, Skipped: 12, Time elapsed: 0.011 sec
Running org.opencastproject.capture.pipeline.bins.consumers.ConsumerBinTest
Tests run: 17, Failures: 0, Errors: 0, Skipped: 0, Time elapsed: 0.144 sec
Running org.opencastproject.capture.impl.ConfigurationManagerTest
Tests run: 8, Failures: 0, Errors: 0, Skipped: 1, Time elapsed: 0.214 sec
Running org.opencastproject.capture.pipeline.bins.consumers.AudioMonitoringConsumerTest
Tests run: 1, Failures: 0, Errors: 0, Skipped: 0, Time elapsed: 3.042 sec
Running org.opencastproject.capture.pipeline.bins.consumers.RTPSinkConsumerTest
Tests run: 7, Failures: 5, Errors: 0, Skipped: 0, Time elapsed: 0.164 sec <<< FAILURE!
testHostPortProperties(org.opencastproject.capture.pipeline.bins.consumers.RTPSinkConsumerTest) Time elapsed: 0.022 sec <<< FAILURE!
java.lang.AssertionError: Unknown property: rc-lookahead
at org.junit.Assert.fail(Assert.java:91)
at org.opencastproject.capture.pipeline.bins.consumers.RTPSinkConsumerTest.testHostPortProperties(RTPSinkConsumerTest.java:171)
at sun.reflect.NativeMethodAccessorImpl.invoke0(Native Method)
at sun.reflect.NativeMethodAccessorImpl.invoke(NativeMethodAccessorImpl.java:57)
at sun.reflect.DelegatingMethodAccessorImpl.invoke(DelegatingMethodAccessorImpl.java:43)
at java.lang.reflect.Method.invoke(Method.java:616)
at org.junit.runners.model.FrameworkMethod$1.runReflectiveCall(FrameworkMethod.java:44)
at org.junit.internal.runners.model.ReflectiveCallable.run(ReflectiveCallable.java:15)
at org.junit.runners.model.FrameworkMethod.invokeExplosively(FrameworkMethod.java:41)
at org.junit.internal.runners.statements.InvokeMethod.evaluate(InvokeMethod.java:20)
at org.junit.internal.runners.statements.RunBefores.evaluate(RunBefores.java:28)
at org.junit.internal.runners.statements.RunAfters.evaluate(RunAfters.java:31)
at org.junit.runners.BlockJUnit4ClassRunner.runChild(BlockJUnit4ClassRunner.java:73)
at org.junit.runners.BlockJUnit4ClassRunner.runChild(BlockJUnit4ClassRunner.java:46)
at org.junit.runners.ParentRunner.runChildren(ParentRunner.java:180)
at org.junit.runners.ParentRunner.access$000(ParentRunner.java:41)
at org.junit.runners.ParentRunner$1.evaluate(ParentRunner.java:173)
at org.junit.internal.runners.statements.RunBefores.evaluate(RunBefores.java:28)
at org.junit.internal.runners.statements.RunAfters.evaluate(RunAfters.java:31)
at org.junit.runners.ParentRunner.run(ParentRunner.java:220)
at org.apache.maven.surefire.junit4.JUnit4TestSet.execute(JUnit4TestSet.java:59)
at org.apache.maven.surefire.suite.AbstractDirectoryTestSuite.executeTestSet(AbstractDirectoryTestSuite.java:120)
at org.apache.maven.surefire.suite.AbstractDirectoryTestSuite.execute(AbstractDirectoryTestSuite.java:103)
at org.apache.maven.surefire.Surefire.run(Surefire.java:169)
at sun.reflect.NativeMethodAccessorImpl.invoke0(Native Method)
at sun.reflect.NativeMethodAccessorImpl.invoke(NativeMethodAccessorImpl.java:57)
at sun.reflect.DelegatingMethodAccessorImpl.invoke(DelegatingMethodAccessorImpl.java:43)
at java.lang.reflect.Method.invoke(Method.java:616)
at org.apache.maven.surefire.booter.SurefireBooter.runSuitesInProcess(SurefireBooter.java:350)
at org.apache.maven.surefire.booter.SurefireBooter.main(SurefireBooter.java:1021)

testAudioEncoderProperties(org.opencastproject.capture.pipeline.bins.consumers.RTPSinkConsumerTest) Time elapsed: 0.022 sec <<< FAILURE!
java.lang.AssertionError: Unknown property: rc-lookahead
at org.junit.Assert.fail(Assert.java:91)
at org.opencastproject.capture.pipeline.bins.consumers.RTPSinkConsumerTest.testAudioEncoderProperties(RTPSinkConsumerTest.java:192)
at sun.reflect.NativeMethodAccessorImpl.invoke0(Native Method)
at sun.reflect.NativeMethodAccessorImpl.invoke(NativeMethodAccessorImpl.java:57)
at sun.reflect.DelegatingMethodAccessorImpl.invoke(DelegatingMethodAccessorImpl.java:43)
at java.lang.reflect.Method.invoke(Method.java:616)
at org.junit.runners.model.FrameworkMethod$1.runReflectiveCall(FrameworkMethod.java:44)
at org.junit.internal.runners.model.ReflectiveCallable.run(ReflectiveCallable.java:15)
at org.junit.runners.model.FrameworkMethod.invokeExplosively(FrameworkMethod.java:41)
at org.junit.internal.runners.statements.InvokeMethod.evaluate(InvokeMethod.java:20)
at org.junit.internal.runners.statements.RunBefores.evaluate(RunBefores.java:28)
at org.junit.internal.runners.statements.RunAfters.evaluate(RunAfters.java:31)
at org.junit.runners.BlockJUnit4ClassRunner.runChild(BlockJUnit4ClassRunner.java:73)
at org.junit.runners.BlockJUnit4ClassRunner.runChild(BlockJUnit4ClassRunner.java:46)
at org.junit.runners.ParentRunner.runChildren(ParentRunner.java:180)
at org.junit.runners.ParentRunner.access$000(ParentRunner.java:41)
at org.junit.runners.ParentRunner$1.evaluate(ParentRunner.java:173)
at org.junit.internal.runners.statements.RunBefores.evaluate(RunBefores.java:28)
at org.junit.internal.runners.statements.RunAfters.evaluate(RunAfters.java:31)
at org.junit.runners.ParentRunner.run(ParentRunner.java:220)
at org.apache.maven.surefire.junit4.JUnit4TestSet.execute(JUnit4TestSet.java:59)
at org.apache.maven.surefire.suite.AbstractDirectoryTestSuite.executeTestSet(AbstractDirectoryTestSuite.java:120)
at org.apache.maven.surefire.suite.AbstractDirectoryTestSuite.execute(AbstractDirectoryTestSuite.java:103)
at org.apache.maven.surefire.Surefire.run(Surefire.java:169)
at sun.reflect.NativeMethodAccessorImpl.invoke0(Native Method)
at sun.reflect.NativeMethodAccessorImpl.invoke(NativeMethodAccessorImpl.java:57)
at sun.reflect.DelegatingMethodAccessorImpl.invoke(DelegatingMethodAccessorImpl.java:43)
at java.lang.reflect.Method.invoke(Method.java:616)
at org.apache.maven.surefire.booter.SurefireBooter.runSuitesInProcess(SurefireBooter.java:350)
at org.apache.maven.surefire.booter.SurefireBooter.main(SurefireBooter.java:1021)

testCustomAudioEncoder(org.opencastproject.capture.pipeline.bins.consumers.RTPSinkConsumerTest) Time elapsed: 0.019 sec <<< FAILURE!
java.lang.AssertionError: Unknown property: rc-lookahead
at org.junit.Assert.fail(Assert.java:91)
at org.opencastproject.capture.pipeline.bins.consumers.RTPSinkConsumerTest.testCustomAudioEncoder(RTPSinkConsumerTest.java:215)
at sun.reflect.NativeMethodAccessorImpl.invoke0(Native Method)
at sun.reflect.NativeMethodAccessorImpl.invoke(NativeMethodAccessorImpl.java:57)
at sun.reflect.DelegatingMethodAccessorImpl.invoke(DelegatingMethodAccessorImpl.java:43)
at java.lang.reflect.Method.invoke(Method.java:616)
at org.junit.runners.model.FrameworkMethod$1.runReflectiveCall(FrameworkMethod.java:44)
at org.junit.internal.runners.model.ReflectiveCallable.run(ReflectiveCallable.java:15)
at org.junit.runners.model.FrameworkMethod.invokeExplosively(FrameworkMethod.java:41)
at org.junit.internal.runners.statements.InvokeMethod.evaluate(InvokeMethod.java:20)
at org.junit.internal.runners.statements.RunBefores.evaluate(RunBefores.java:28)
at org.junit.internal.runners.statements.RunAfters.evaluate(RunAfters.java:31)
at org.junit.runners.BlockJUnit4ClassRunner.runChild(BlockJUnit4ClassRunner.java:73)
at org.junit.runners.BlockJUnit4ClassRunner.runChild(BlockJUnit4ClassRunner.java:46)
at org.junit.runners.ParentRunner.runChildren(ParentRunner.java:180)
at org.junit.runners.ParentRunner.access$000(ParentRunner.java:41)
at org.junit.runners.ParentRunner$1.evaluate(ParentRunner.java:173)
at org.junit.internal.runners.statements.RunBefores.evaluate(RunBefores.java:28)
at org.junit.internal.runners.statements.RunAfters.evaluate(RunAfters.java:31)
at org.junit.runners.ParentRunner.run(ParentRunner.java:220)
at org.apache.maven.surefire.junit4.JUnit4TestSet.execute(JUnit4TestSet.java:59)
at org.apache.maven.surefire.suite.AbstractDirectoryTestSuite.executeTestSet(AbstractDirectoryTestSuite.java:120)
at org.apache.maven.surefire.suite.AbstractDirectoryTestSuite.execute(AbstractDirectoryTestSuite.java:103)
at org.apache.maven.surefire.Surefire.run(Surefire.java:169)
at sun.reflect.NativeMethodAccessorImpl.invoke0(Native Method)
at sun.reflect.NativeMethodAccessorImpl.invoke(NativeMethodAccessorImpl.java:57)
at sun.reflect.DelegatingMethodAccessorImpl.invoke(DelegatingMethodAccessorImpl.java:43)
at java.lang.reflect.Method.invoke(Method.java:616)
at org.apache.maven.surefire.booter.SurefireBooter.runSuitesInProcess(SurefireBooter.java:350)
at org.apache.maven.surefire.booter.SurefireBooter.main(SurefireBooter.java:1021)

testVideoEncoderProperties(org.opencastproject.capture.pipeline.bins.consumers.RTPSinkConsumerTest) Time elapsed: 0.019 sec <<< FAILURE!
java.lang.AssertionError: Unknown property: rc-lookahead
at org.junit.Assert.fail(Assert.java:91)
at org.opencastproject.capture.pipeline.bins.consumers.RTPSinkConsumerTest.testVideoEncoderProperties(RTPSinkConsumerTest.java:235)
at sun.reflect.NativeMethodAccessorImpl.invoke0(Native Method)
at sun.reflect.NativeMethodAccessorImpl.invoke(NativeMethodAccessorImpl.java:57)
at sun.reflect.DelegatingMethodAccessorImpl.invoke(DelegatingMethodAccessorImpl.java:43)
at java.lang.reflect.Method.invoke(Method.java:616)
at org.junit.runners.model.FrameworkMethod$1.runReflectiveCall(FrameworkMethod.java:44)
at org.junit.internal.runners.model.ReflectiveCallable.run(ReflectiveCallable.java:15)
at org.junit.runners.model.FrameworkMethod.invokeExplosively(FrameworkMethod.java:41)
at org.junit.internal.runners.statements.InvokeMethod.evaluate(InvokeMethod.java:20)
at org.junit.internal.runners.statements.RunBefores.evaluate(RunBefores.java:28)
at org.junit.internal.runners.statements.RunAfters.evaluate(RunAfters.java:31)
at org.junit.runners.BlockJUnit4ClassRunner.runChild(BlockJUnit4ClassRunner.java:73)
at org.junit.runners.BlockJUnit4ClassRunner.runChild(BlockJUnit4ClassRunner.java:46)
at org.junit.runners.ParentRunner.runChildren(ParentRunner.java:180)
at org.junit.runners.ParentRunner.access$000(ParentRunner.java:41)
at org.junit.runners.ParentRunner$1.evaluate(ParentRunner.java:173)
at org.junit.internal.runners.statements.RunBefores.evaluate(RunBefores.java:28)
at org.junit.internal.runners.statements.RunAfters.evaluate(RunAfters.java:31)
at org.junit.runners.ParentRunner.run(ParentRunner.java:220)
at org.apache.maven.surefire.junit4.JUnit4TestSet.execute(JUnit4TestSet.java:59)
at org.apache.maven.surefire.suite.AbstractDirectoryTestSuite.executeTestSet(AbstractDirectoryTestSuite.java:120)
at org.apache.maven.surefire.suite.AbstractDirectoryTestSuite.execute(AbstractDirectoryTestSuite.java:103)
at org.apache.maven.surefire.Surefire.run(Surefire.java:169)
at sun.reflect.NativeMethodAccessorImpl.invoke0(Native Method)
at sun.reflect.NativeMethodAccessorImpl.invoke(NativeMethodAccessorImpl.java:57)
at sun.reflect.DelegatingMethodAccessorImpl.invoke(DelegatingMethodAccessorImpl.java:43)
at java.lang.reflect.Method.invoke(Method.java:616)
at org.apache.maven.surefire.booter.SurefireBooter.runSuitesInProcess(SurefireBooter.java:350)
at org.apache.maven.surefire.booter.SurefireBooter.main(SurefireBooter.java:1021)

testVideoFramerate(org.opencastproject.capture.pipeline.bins.consumers.RTPSinkConsumerTest) Time elapsed: 0.017 sec <<< FAILURE!
java.lang.AssertionError: Unknown property: rc-lookahead
at org.junit.Assert.fail(Assert.java:91)
at org.opencastproject.capture.pipeline.bins.consumers.RTPSinkConsumerTest.testVideoFramerate(RTPSinkConsumerTest.java:278)
at sun.reflect.NativeMethodAccessorImpl.invoke0(Native Method)
at sun.reflect.NativeMethodAccessorImpl.invoke(NativeMethodAccessorImpl.java:57)
at sun.reflect.DelegatingMethodAccessorImpl.invoke(DelegatingMethodAccessorImpl.java:43)
at java.lang.reflect.Method.invoke(Method.java:616)
at org.junit.runners.model.FrameworkMethod$1.runReflectiveCall(FrameworkMethod.java:44)
at org.junit.internal.runners.model.ReflectiveCallable.run(ReflectiveCallable.java:15)
at org.junit.runners.model.FrameworkMethod.invokeExplosively(FrameworkMethod.java:41)
at org.junit.internal.runners.statements.InvokeMethod.evaluate(InvokeMethod.java:20)
at org.junit.internal.runners.statements.RunBefores.evaluate(RunBefores.java:28)
at org.junit.internal.runners.statements.RunAfters.evaluate(RunAfters.java:31)
at org.junit.runners.BlockJUnit4ClassRunner.runChild(BlockJUnit4ClassRunner.java:73)
at org.junit.runners.BlockJUnit4ClassRunner.runChild(BlockJUnit4ClassRunner.java:46)
at org.junit.runners.ParentRunner.runChildren(ParentRunner.java:180)
at org.junit.runners.ParentRunner.access$000(ParentRunner.java:41)
at org.junit.runners.ParentRunner$1.evaluate(ParentRunner.java:173)
at org.junit.internal.runners.statements.RunBefores.evaluate(RunBefores.java:28)
at org.junit.internal.runners.statements.RunAfters.evaluate(RunAfters.java:31)
at org.junit.runners.ParentRunner.run(ParentRunner.java:220)
at org.apache.maven.surefire.junit4.JUnit4TestSet.execute(JUnit4TestSet.java:59)
at org.apache.maven.surefire.suite.AbstractDirectoryTestSuite.executeTestSet(AbstractDirectoryTestSuite.java:120)
at org.apache.maven.surefire.suite.AbstractDirectoryTestSuite.execute(AbstractDirectoryTestSuite.java:103)
at org.apache.maven.surefire.Surefire.run(Surefire.java:169)
at sun.reflect.NativeMethodAccessorImpl.invoke0(Native Method)
at sun.reflect.NativeMethodAccessorImpl.invoke(NativeMethodAccessorImpl.java:57)
at sun.reflect.DelegatingMethodAccessorImpl.invoke(DelegatingMethodAccessorImpl.java:43)
at java.lang.reflect.Method.invoke(Method.java:616)
at org.apache.maven.surefire.booter.SurefireBooter.runSuitesInProcess(SurefireBooter.java:350)
at org.apache.maven.surefire.booter.SurefireBooter.main(SurefireBooter.java:1021)

Running org.opencastproject.capture.pipeline.bins.consumers.ConsumerFactoryTest
Tests run: 5, Failures: 0, Errors: 1, Skipped: 0, Time elapsed: 0.033 sec <<< FAILURE!
testVideoFileSink(org.opencastproject.capture.pipeline.bins.consumers.ConsumerFactoryTest) Time elapsed: 0.004 sec <<< ERROR!
java.lang.IllegalArgumentException: Unknown property: speed-preset
at org.gstreamer.GObject.set(GObject.java:87)
at org.opencastproject.capture.pipeline.bins.consumers.VideoFilesinkConsumer.setEncoderProperty(VideoFilesinkConsumer.java:231)
at org.opencastproject.capture.pipeline.bins.consumers.VideoFilesinkConsumer.setX264EncoderProperties(VideoFilesinkConsumer.java:207)
at org.opencastproject.capture.pipeline.bins.consumers.VideoFilesinkConsumer.setEncoderProperties(VideoFilesinkConsumer.java:193)
at org.opencastproject.capture.pipeline.bins.consumers.VideoFilesinkConsumer.setElementProperties(VideoFilesinkConsumer.java:150)
at org.opencastproject.capture.pipeline.bins.PartialBin.<init>(PartialBin.java:65)
at org.opencastproject.capture.pipeline.bins.consumers.ConsumerBin.<init>(ConsumerBin.java:80)
at org.opencastproject.capture.pipeline.bins.consumers.VideoFilesinkConsumer.<init>(VideoFilesinkConsumer.java:70)
at org.opencastproject.capture.pipeline.bins.consumers.ConsumerFactory.getSink(ConsumerFactory.java:80)
at org.opencastproject.capture.pipeline.bins.consumers.ConsumerFactoryTest.getSink(ConsumerFactoryTest.java:158)
at org.opencastproject.capture.pipeline.bins.consumers.ConsumerFactoryTest.testVideoFileSink(ConsumerFactoryTest.java:107)
at sun.reflect.NativeMethodAccessorImpl.invoke0(Native Method)
at sun.reflect.NativeMethodAccessorImpl.invoke(NativeMethodAccessorImpl.java:57)
at sun.reflect.DelegatingMethodAccessorImpl.invoke(DelegatingMethodAccessorImpl.java:43)
at java.lang.reflect.Method.invoke(Method.java:616)
at org.junit.runners.model.FrameworkMethod$1.runReflectiveCall(FrameworkMethod.java:44)
at org.junit.internal.runners.model.ReflectiveCallable.run(ReflectiveCallable.java:15)
at org.junit.runners.model.FrameworkMethod.invokeExplosively(FrameworkMethod.java:41)
at org.junit.internal.runners.statements.InvokeMethod.evaluate(InvokeMethod.java:20)
at org.junit.internal.runners.statements.RunBefores.evaluate(RunBefores.java:28)
at org.junit.internal.runners.statements.RunAfters.evaluate(RunAfters.java:31)
at org.junit.runners.BlockJUnit4ClassRunner.runChild(BlockJUnit4ClassRunner.java:73)
at org.junit.runners.BlockJUnit4ClassRunner.runChild(BlockJUnit4ClassRunner.java:46)
at org.junit.runners.ParentRunner.runChildren(ParentRunner.java:180)
at org.junit.runners.ParentRunner.access$000(ParentRunner.java:41)
at org.junit.runners.ParentRunner$1.evaluate(ParentRunner.java:173)
at org.junit.internal.runners.statements.RunBefores.evaluate(RunBefores.java:28)
at org.junit.internal.runners.statements.RunAfters.evaluate(RunAfters.java:31)
at org.junit.runners.ParentRunner.run(ParentRunner.java:220)
at org.apache.maven.surefire.junit4.JUnit4TestSet.execute(JUnit4TestSet.java:59)
at org.apache.maven.surefire.suite.AbstractDirectoryTestSuite.executeTestSet(AbstractDirectoryTestSuite.java:120)
at org.apache.maven.surefire.suite.AbstractDirectoryTestSuite.execute(AbstractDirectoryTestSuite.java:103)
at org.apache.maven.surefire.Surefire.run(Surefire.java:169)
at sun.reflect.NativeMethodAccessorImpl.invoke0(Native Method)
at sun.reflect.NativeMethodAccessorImpl.invoke(NativeMethodAccessorImpl.java:57)
at sun.reflect.DelegatingMethodAccessorImpl.invoke(DelegatingMethodAccessorImpl.java:43)
at java.lang.reflect.Method.invoke(Method.java:616)
at org.apache.maven.surefire.booter.SurefireBooter.runSuitesInProcess(SurefireBooter.java:350)
at org.apache.maven.surefire.booter.SurefireBooter.main(SurefireBooter.java:1021)

Running org.opencastproject.capture.pipeline.bins.consumers.VideoMonitoringConsumerTest
Tests run: 1, Failures: 0, Errors: 0, Skipped: 0, Time elapsed: 3.084 sec
Running org.opencastproject.capture.pipeline.bins.consumers.VideoFilesinkConsumerTest
java.lang.IllegalArgumentException: Unknown property: speed-preset
at org.gstreamer.GObject.set(GObject.java:87)
at org.opencastproject.capture.pipeline.bins.consumers.VideoFilesinkConsumer.setEncoderProperty(VideoFilesinkConsumer.java:231)
at org.opencastproject.capture.pipeline.bins.consumers.VideoFilesinkConsumer.setX264EncoderProperties(VideoFilesinkConsumer.java:207)
at org.opencastproject.capture.pipeline.bins.consumers.VideoFilesinkConsumer.setEncoderProperties(VideoFilesinkConsumer.java:193)
at org.opencastproject.capture.pipeline.bins.consumers.VideoFilesinkConsumer.setElementProperties(VideoFilesinkConsumer.java:150)
at org.opencastproject.capture.pipeline.bins.PartialBin.<init>(PartialBin.java:65)
at org.opencastproject.capture.pipeline.bins.consumers.ConsumerBin.<init>(ConsumerBin.java:80)
at org.opencastproject.capture.pipeline.bins.consumers.VideoFilesinkConsumer.<init>(VideoFilesinkConsumer.java:70)
at org.opencastproject.capture.pipeline.bins.consumers.VideoFilesinkConsumerTest.createVideoFileSinkBin(VideoFilesinkConsumerTest.java:270)
at org.opencastproject.capture.pipeline.bins.consumers.VideoFilesinkConsumerTest.createVideoFileSinkBinDontWantException(VideoFilesinkConsumerTest.java:249)
at org.opencastproject.capture.pipeline.bins.consumers.VideoFilesinkConsumerTest.nullSettingsForCodecBitrateAndContainerCreatesElementsWithDefaults(VideoFilesinkConsumerTest.java:128)
at sun.reflect.NativeMethodAccessorImpl.invoke0(Native Method)
at sun.reflect.NativeMethodAccessorImpl.invoke(NativeMethodAccessorImpl.java:57)
at sun.reflect.DelegatingMethodAccessorImpl.invoke(DelegatingMethodAccessorImpl.java:43)
at java.lang.reflect.Method.invoke(Method.java:616)
at org.junit.runners.model.FrameworkMethod$1.runReflectiveCall(FrameworkMethod.java:44)
at org.junit.internal.runners.model.ReflectiveCallable.run(ReflectiveCallable.java:15)
at org.junit.runners.model.FrameworkMethod.invokeExplosively(FrameworkMethod.java:41)
at org.junit.internal.runners.statements.InvokeMethod.evaluate(InvokeMethod.java:20)
at org.junit.internal.runners.statements.RunBefores.evaluate(RunBefores.java:28)
at org.junit.internal.runners.statements.RunAfters.evaluate(RunAfters.java:31)
at org.junit.runners.BlockJUnit4ClassRunner.runChild(BlockJUnit4ClassRunner.java:73)
at org.junit.runners.BlockJUnit4ClassRunner.runChild(BlockJUnit4ClassRunner.java:46)
at org.junit.runners.ParentRunner.runChildren(ParentRunner.java:180)
at org.junit.runners.ParentRunner.access$000(ParentRunner.java:41)
at org.junit.runners.ParentRunner$1.evaluate(ParentRunner.java:173)
at org.junit.internal.runners.statements.RunBefores.evaluate(RunBefores.java:28)
at org.junit.internal.runners.statements.RunAfters.evaluate(RunAfters.java:31)
at org.junit.runners.ParentRunner.run(ParentRunner.java:220)
at org.apache.maven.surefire.junit4.JUnit4TestSet.execute(JUnit4TestSet.java:59)
at org.apache.maven.surefire.suite.AbstractDirectoryTestSuite.executeTestSet(AbstractDirectoryTestSuite.java:120)
at org.apache.maven.surefire.suite.AbstractDirectoryTestSuite.execute(AbstractDirectoryTestSuite.java:103)
at org.apache.maven.surefire.Surefire.run(Surefire.java:169)
at sun.reflect.NativeMethodAccessorImpl.invoke0(Native Method)
at sun.reflect.NativeMethodAccessorImpl.invoke(NativeMethodAccessorImpl.java:57)
at sun.reflect.DelegatingMethodAccessorImpl.invoke(DelegatingMethodAccessorImpl.java:43)
at java.lang.reflect.Method.invoke(Method.java:616)
at org.apache.maven.surefire.booter.SurefireBooter.runSuitesInProcess(SurefireBooter.java:350)
at org.apache.maven.surefire.booter.SurefireBooter.main(SurefireBooter.java:1021)
java.lang.IllegalArgumentException: Unknown property: speed-preset
at org.gstreamer.GObject.set(GObject.java:87)
at org.opencastproject.capture.pipeline.bins.consumers.VideoFilesinkConsumer.setEncoderProperty(VideoFilesinkConsumer.java:231)
at org.opencastproject.capture.pipeline.bins.consumers.VideoFilesinkConsumer.setX264EncoderProperties(VideoFilesinkConsumer.java:207)
at org.opencastproject.capture.pipeline.bins.consumers.VideoFilesinkConsumer.setEncoderProperties(VideoFilesinkConsumer.java:193)
at org.opencastproject.capture.pipeline.bins.consumers.VideoFilesinkConsumer.setElementProperties(VideoFilesinkConsumer.java:150)
at org.opencastproject.capture.pipeline.bins.PartialBin.<init>(PartialBin.java:65)
at org.opencastproject.capture.pipeline.bins.consumers.ConsumerBin.<init>(ConsumerBin.java:80)
at org.opencastproject.capture.pipeline.bins.consumers.VideoFilesinkConsumer.<init>(VideoFilesinkConsumer.java:70)
at org.opencastproject.capture.pipeline.bins.consumers.VideoFilesinkConsumerTest.createVideoFileSinkBin(VideoFilesinkConsumerTest.java:270)
at org.opencastproject.capture.pipeline.bins.consumers.VideoFilesinkConsumerTest.createVideoFileSinkBinDontWantException(VideoFilesinkConsumerTest.java:249)
at org.opencastproject.capture.pipeline.bins.consumers.VideoFilesinkConsumerTest.settingBitrateChangesCodecBitrate(VideoFilesinkConsumerTest.java:140)
at sun.reflect.NativeMethodAccessorImpl.invoke0(Native Method)
at sun.reflect.NativeMethodAccessorImpl.invoke(NativeMethodAccessorImpl.java:57)
at sun.reflect.DelegatingMethodAccessorImpl.invoke(DelegatingMethodAccessorImpl.java:43)
at java.lang.reflect.Method.invoke(Method.java:616)
at org.junit.runners.model.FrameworkMethod$1.runReflectiveCall(FrameworkMethod.java:44)
at org.junit.internal.runners.model.ReflectiveCallable.run(ReflectiveCallable.java:15)
at org.junit.runners.model.FrameworkMethod.invokeExplosively(FrameworkMethod.java:41)
at org.junit.internal.runners.statements.InvokeMethod.evaluate(InvokeMethod.java:20)
at org.junit.internal.runners.statements.RunBefores.evaluate(RunBefores.java:28)
at org.junit.internal.runners.statements.RunAfters.evaluate(RunAfters.java:31)
at org.junit.runners.BlockJUnit4ClassRunner.runChild(BlockJUnit4ClassRunner.java:73)
at org.junit.runners.BlockJUnit4ClassRunner.runChild(BlockJUnit4ClassRunner.java:46)
at org.junit.runners.ParentRunner.runChildren(ParentRunner.java:180)
at org.junit.runners.ParentRunner.access$000(ParentRunner.java:41)
at org.junit.runners.ParentRunner$1.evaluate(ParentRunner.java:173)
at org.junit.internal.runners.statements.RunBefores.evaluate(RunBefores.java:28)
at org.junit.internal.runners.statements.RunAfters.evaluate(RunAfters.java:31)
at org.junit.runners.ParentRunner.run(ParentRunner.java:220)
at org.apache.maven.surefire.junit4.JUnit4TestSet.execute(JUnit4TestSet.java:59)
at org.apache.maven.surefire.suite.AbstractDirectoryTestSuite.executeTestSet(AbstractDirectoryTestSuite.java:120)
at org.apache.maven.surefire.suite.AbstractDirectoryTestSuite.execute(AbstractDirectoryTestSuite.java:103)
at org.apache.maven.surefire.Surefire.run(Surefire.java:169)
at sun.reflect.NativeMethodAccessorImpl.invoke0(Native Method)
at sun.reflect.NativeMethodAccessorImpl.invoke(NativeMethodAccessorImpl.java:57)
at sun.reflect.DelegatingMethodAccessorImpl.invoke(DelegatingMethodAccessorImpl.java:43)
at java.lang.reflect.Method.invoke(Method.java:616)
at org.apache.maven.surefire.booter.SurefireBooter.runSuitesInProcess(SurefireBooter.java:350)
at org.apache.maven.surefire.booter.SurefireBooter.main(SurefireBooter.java:1021)
java.lang.IllegalArgumentException: Unknown property: speed-preset
at org.gstreamer.GObject.set(GObject.java:87)
at org.opencastproject.capture.pipeline.bins.consumers.VideoFilesinkConsumer.setEncoderProperty(VideoFilesinkConsumer.java:231)
at org.opencastproject.capture.pipeline.bins.consumers.VideoFilesinkConsumer.setX264EncoderProperties(VideoFilesinkConsumer.java:207)
at org.opencastproject.capture.pipeline.bins.consumers.VideoFilesinkConsumer.setEncoderProperties(VideoFilesinkConsumer.java:193)
at org.opencastproject.capture.pipeline.bins.consumers.VideoFilesinkConsumer.setElementProperties(VideoFilesinkConsumer.java:150)
at org.opencastproject.capture.pipeline.bins.PartialBin.<init>(PartialBin.java:65)
at org.opencastproject.capture.pipeline.bins.consumers.ConsumerBin.<init>(ConsumerBin.java:80)
at org.opencastproject.capture.pipeline.bins.consumers.VideoFilesinkConsumer.<init>(VideoFilesinkConsumer.java:70)
at org.opencastproject.capture.pipeline.bins.consumers.VideoFilesinkConsumerTest.createVideoFileSinkBin(VideoFilesinkConsumerTest.java:270)
at org.opencastproject.capture.pipeline.bins.consumers.VideoFilesinkConsumerTest.createVideoFileSinkBinDontWantException(VideoFilesinkConsumerTest.java:249)
at org.opencastproject.capture.pipeline.bins.consumers.VideoFilesinkConsumerTest.settingCodecButNotContainerResultsInCorrectCodecAndDefaultMuxer(VideoFilesinkConsumerTest.java:192)
at sun.reflect.NativeMethodAccessorImpl.invoke0(Native Method)
at sun.reflect.NativeMethodAccessorImpl.invoke(NativeMethodAccessorImpl.java:57)
at sun.reflect.DelegatingMethodAccessorImpl.invoke(DelegatingMethodAccessorImpl.java:43)
at java.lang.reflect.Method.invoke(Method.java:616)
at org.junit.runners.model.FrameworkMethod$1.runReflectiveCall(FrameworkMethod.java:44)
at org.junit.internal.runners.model.ReflectiveCallable.run(ReflectiveCallable.java:15)
at org.junit.runners.model.FrameworkMethod.invokeExplosively(FrameworkMethod.java:41)
at org.junit.internal.runners.statements.InvokeMethod.evaluate(InvokeMethod.java:20)
at org.junit.internal.runners.statements.RunBefores.evaluate(RunBefores.java:28)
at org.junit.internal.runners.statements.RunAfters.evaluate(RunAfters.java:31)
at org.junit.runners.BlockJUnit4ClassRunner.runChild(BlockJUnit4ClassRunner.java:73)
at org.junit.runners.BlockJUnit4ClassRunner.runChild(BlockJUnit4ClassRunner.java:46)
at org.junit.runners.ParentRunner.runChildren(ParentRunner.java:180)
at org.junit.runners.ParentRunner.access$000(ParentRunner.java:41)
at org.junit.runners.ParentRunner$1.evaluate(ParentRunner.java:173)
at org.junit.internal.runners.statements.RunBefores.evaluate(RunBefores.java:28)
at org.junit.internal.runners.statements.RunAfters.evaluate(RunAfters.java:31)
at org.junit.runners.ParentRunner.run(ParentRunner.java:220)
at org.apache.maven.surefire.junit4.JUnit4TestSet.execute(JUnit4TestSet.java:59)
at org.apache.maven.surefire.suite.AbstractDirectoryTestSuite.executeTestSet(AbstractDirectoryTestSuite.java:120)
at org.apache.maven.surefire.suite.AbstractDirectoryTestSuite.execute(AbstractDirectoryTestSuite.java:103)
at org.apache.maven.surefire.Surefire.run(Surefire.java:169)
at sun.reflect.NativeMethodAccessorImpl.invoke0(Native Method)
at sun.reflect.NativeMethodAccessorImpl.invoke(NativeMethodAccessorImpl.java:57)
at sun.reflect.DelegatingMethodAccessorImpl.invoke(DelegatingMethodAccessorImpl.java:43)
at java.lang.reflect.Method.invoke(Method.java:616)
at org.apache.maven.surefire.booter.SurefireBooter.runSuitesInProcess(SurefireBooter.java:350)
at org.apache.maven.surefire.booter.SurefireBooter.main(SurefireBooter.java:1021)
java.lang.IllegalArgumentException: Unknown property: speed-preset
at org.gstreamer.GObject.set(GObject.java:87)
at org.opencastproject.capture.pipeline.bins.consumers.VideoFilesinkConsumer.setEncoderProperty(VideoFilesinkConsumer.java:231)
at org.opencastproject.capture.pipeline.bins.consumers.VideoFilesinkConsumer.setX264EncoderProperties(VideoFilesinkConsumer.java:207)
at org.opencastproject.capture.pipeline.bins.consumers.VideoFilesinkConsumer.setEncoderProperties(VideoFilesinkConsumer.java:193)
at org.opencastproject.capture.pipeline.bins.consumers.VideoFilesinkConsumer.setElementProperties(VideoFilesinkConsumer.java:150)
at org.opencastproject.capture.pipeline.bins.PartialBin.<init>(PartialBin.java:65)
at org.opencastproject.capture.pipeline.bins.consumers.ConsumerBin.<init>(ConsumerBin.java:80)
at org.opencastproject.capture.pipeline.bins.consumers.VideoFilesinkConsumer.<init>(VideoFilesinkConsumer.java:70)
at org.opencastproject.capture.pipeline.bins.consumers.VideoFilesinkConsumerTest.createVideoFileSinkBin(VideoFilesinkConsumerTest.java:270)
at org.opencastproject.capture.pipeline.bins.consumers.VideoFilesinkConsumerTest.createVideoFileSinkBinDontWantException(VideoFilesinkConsumerTest.java:249)
at org.opencastproject.capture.pipeline.bins.consumers.VideoFilesinkConsumerTest.settingContainerResultsInCorrectMuxer(VideoFilesinkConsumerTest.java:204)
at sun.reflect.NativeMethodAccessorImpl.invoke0(Native Method)
at sun.reflect.NativeMethodAccessorImpl.invoke(NativeMethodAccessorImpl.java:57)
at sun.reflect.DelegatingMethodAccessorImpl.invoke(DelegatingMethodAccessorImpl.java:43)
at java.lang.reflect.Method.invoke(Method.java:616)
at org.junit.runners.model.FrameworkMethod$1.runReflectiveCall(FrameworkMethod.java:44)
at org.junit.internal.runners.model.ReflectiveCallable.run(ReflectiveCallable.java:15)
at org.junit.runners.model.FrameworkMethod.invokeExplosively(FrameworkMethod.java:41)
at org.junit.internal.runners.statements.InvokeMethod.evaluate(InvokeMethod.java:20)
at org.junit.internal.runners.statements.RunBefores.evaluate(RunBefores.java:28)
at org.junit.internal.runners.statements.RunAfters.evaluate(RunAfters.java:31)
at org.junit.runners.BlockJUnit4ClassRunner.runChild(BlockJUnit4ClassRunner.java:73)
at org.junit.runners.BlockJUnit4ClassRunner.runChild(BlockJUnit4ClassRunner.java:46)
at org.junit.runners.ParentRunner.runChildren(ParentRunner.java:180)
at org.junit.runners.ParentRunner.access$000(ParentRunner.java:41)
at org.junit.runners.ParentRunner$1.evaluate(ParentRunner.java:173)
at org.junit.internal.runners.statements.RunBefores.evaluate(RunBefores.java:28)
at org.junit.internal.runners.statements.RunAfters.evaluate(RunAfters.java:31)
at org.junit.runners.ParentRunner.run(ParentRunner.java:220)
at org.apache.maven.surefire.junit4.JUnit4TestSet.execute(JUnit4TestSet.java:59)
at org.apache.maven.surefire.suite.AbstractDirectoryTestSuite.executeTestSet(AbstractDirectoryTestSuite.java:120)
at org.apache.maven.surefire.suite.AbstractDirectoryTestSuite.execute(AbstractDirectoryTestSuite.java:103)
at org.apache.maven.surefire.Surefire.run(Surefire.java:169)
at sun.reflect.NativeMethodAccessorImpl.invoke0(Native Method)
at sun.reflect.NativeMethodAccessorImpl.invoke(NativeMethodAccessorImpl.java:57)
at sun.reflect.DelegatingMethodAccessorImpl.invoke(DelegatingMethodAccessorImpl.java:43)
at java.lang.reflect.Method.invoke(Method.java:616)
at org.apache.maven.surefire.booter.SurefireBooter.runSuitesInProcess(SurefireBooter.java:350)
at org.apache.maven.surefire.booter.SurefireBooter.main(SurefireBooter.java:1021)
java.lang.IllegalArgumentException: Unknown property: speed-preset
at org.gstreamer.GObject.set(GObject.java:87)
at org.opencastproject.capture.pipeline.bins.consumers.VideoFilesinkConsumer.setEncoderProperty(VideoFilesinkConsumer.java:231)
at org.opencastproject.capture.pipeline.bins.consumers.VideoFilesinkConsumer.setX264EncoderProperties(VideoFilesinkConsumer.java:207)
at org.opencastproject.capture.pipeline.bins.consumers.VideoFilesinkConsumer.setEncoderProperties(VideoFilesinkConsumer.java:193)
at org.opencastproject.capture.pipeline.bins.consumers.VideoFilesinkConsumer.setElementProperties(VideoFilesinkConsumer.java:150)
at org.opencastproject.capture.pipeline.bins.PartialBin.<init>(PartialBin.java:65)
at org.opencastproject.capture.pipeline.bins.consumers.ConsumerBin.<init>(ConsumerBin.java:80)
at org.opencastproject.capture.pipeline.bins.consumers.VideoFilesinkConsumer.<init>(VideoFilesinkConsumer.java:70)
at org.opencastproject.capture.pipeline.bins.consumers.VideoFilesinkConsumerTest.createVideoFileSinkBin(VideoFilesinkConsumerTest.java:270)
at org.opencastproject.capture.pipeline.bins.consumers.VideoFilesinkConsumerTest.createVideoFileSinkBinDontWantException(VideoFilesinkConsumerTest.java:249)
at org.opencastproject.capture.pipeline.bins.consumers.VideoFilesinkConsumerTest.realFileLocationExampleSetsPropertyAndDoesntThrowException(VideoFilesinkConsumerTest.java:218)
at sun.reflect.NativeMethodAccessorImpl.invoke0(Native Method)
at sun.reflect.NativeMethodAccessorImpl.invoke(NativeMethodAccessorImpl.java:57)
at sun.reflect.DelegatingMethodAccessorImpl.invoke(DelegatingMethodAccessorImpl.java:43)
at java.lang.reflect.Method.invoke(Method.java:616)
at org.junit.runners.model.FrameworkMethod$1.runReflectiveCall(FrameworkMethod.java:44)
at org.junit.internal.runners.model.ReflectiveCallable.run(ReflectiveCallable.java:15)
at org.junit.runners.model.FrameworkMethod.invokeExplosively(FrameworkMethod.java:41)
at org.junit.internal.runners.statements.InvokeMethod.evaluate(InvokeMethod.java:20)
at org.junit.internal.runners.statements.RunBefores.evaluate(RunBefores.java:28)
at org.junit.internal.runners.statements.RunAfters.evaluate(RunAfters.java:31)
at org.junit.runners.BlockJUnit4ClassRunner.runChild(BlockJUnit4ClassRunner.java:73)
at org.junit.runners.BlockJUnit4ClassRunner.runChild(BlockJUnit4ClassRunner.java:46)
at org.junit.runners.ParentRunner.runChildren(ParentRunner.java:180)
at org.junit.runners.ParentRunner.access$000(ParentRunner.java:41)
at org.junit.runners.ParentRunner$1.evaluate(ParentRunner.java:173)
at org.junit.internal.runners.statements.RunBefores.evaluate(RunBefores.java:28)
at org.junit.internal.runners.statements.RunAfters.evaluate(RunAfters.java:31)
at org.junit.runners.ParentRunner.run(ParentRunner.java:220)
at org.apache.maven.surefire.junit4.JUnit4TestSet.execute(JUnit4TestSet.java:59)
at org.apache.maven.surefire.suite.AbstractDirectoryTestSuite.executeTestSet(AbstractDirectoryTestSuite.java:120)
at org.apache.maven.surefire.suite.AbstractDirectoryTestSuite.execute(AbstractDirectoryTestSuite.java:103)
at org.apache.maven.surefire.Surefire.run(Surefire.java:169)
at sun.reflect.NativeMethodAccessorImpl.invoke0(Native Method)
at sun.reflect.NativeMethodAccessorImpl.invoke(NativeMethodAccessorImpl.java:57)
at sun.reflect.DelegatingMethodAccessorImpl.invoke(DelegatingMethodAccessorImpl.java:43)
at java.lang.reflect.Method.invoke(Method.java:616)
at org.apache.maven.surefire.booter.SurefireBooter.runSuitesInProcess(SurefireBooter.java:350)
at org.apache.maven.surefire.booter.SurefireBooter.main(SurefireBooter.java:1021)
Tests run: 8, Failures: 5, Errors: 1, Skipped: 0, Time elapsed: 0.04 sec <<< FAILURE!
nullSettingsForCodecBitrateAndContainerCreatesElementsWithDefaults(org.opencastproject.capture.pipeline.bins.consumers.VideoFilesinkConsumerTest) Time elapsed: 0.006 sec <<< FAILURE!
java.lang.AssertionError:
at org.junit.Assert.fail(Assert.java:91)
at org.junit.Assert.fail(Assert.java:98)
at org.opencastproject.capture.pipeline.bins.consumers.VideoFilesinkConsumerTest.createVideoFileSinkBinDontWantException(VideoFilesinkConsumerTest.java:252)
at org.opencastproject.capture.pipeline.bins.consumers.VideoFilesinkConsumerTest.nullSettingsForCodecBitrateAndContainerCreatesElementsWithDefaults(VideoFilesinkConsumerTest.java:128)
at sun.reflect.NativeMethodAccessorImpl.invoke0(Native Method)
at sun.reflect.NativeMethodAccessorImpl.invoke(NativeMethodAccessorImpl.java:57)
at sun.reflect.DelegatingMethodAccessorImpl.invoke(DelegatingMethodAccessorImpl.java:43)
at java.lang.reflect.Method.invoke(Method.java:616)
at org.junit.runners.model.FrameworkMethod$1.runReflectiveCall(FrameworkMethod.java:44)
at org.junit.internal.runners.model.ReflectiveCallable.run(ReflectiveCallable.java:15)
at org.junit.runners.model.FrameworkMethod.invokeExplosively(FrameworkMethod.java:41)
at org.junit.internal.runners.statements.InvokeMethod.evaluate(InvokeMethod.java:20)
at org.junit.internal.runners.statements.RunBefores.evaluate(RunBefores.java:28)
at org.junit.internal.runners.statements.RunAfters.evaluate(RunAfters.java:31)
at org.junit.runners.BlockJUnit4ClassRunner.runChild(BlockJUnit4ClassRunner.java:73)
at org.junit.runners.BlockJUnit4ClassRunner.runChild(BlockJUnit4ClassRunner.java:46)
at org.junit.runners.ParentRunner.runChildren(ParentRunner.java:180)
at org.junit.runners.ParentRunner.access$000(ParentRunner.java:41)
at org.junit.runners.ParentRunner$1.evaluate(ParentRunner.java:173)
at org.junit.internal.runners.statements.RunBefores.evaluate(RunBefores.java:28)
at org.junit.internal.runners.statements.RunAfters.evaluate(RunAfters.java:31)
at org.junit.runners.ParentRunner.run(ParentRunner.java:220)
at org.apache.maven.surefire.junit4.JUnit4TestSet.execute(JUnit4TestSet.java:59)
at org.apache.maven.surefire.suite.AbstractDirectoryTestSuite.executeTestSet(AbstractDirectoryTestSuite.java:120)
at org.apache.maven.surefire.suite.AbstractDirectoryTestSuite.execute(AbstractDirectoryTestSuite.java:103)
at org.apache.maven.surefire.Surefire.run(Surefire.java:169)
at sun.reflect.NativeMethodAccessorImpl.invoke0(Native Method)
at sun.reflect.NativeMethodAccessorImpl.invoke(NativeMethodAccessorImpl.java:57)
at sun.reflect.DelegatingMethodAccessorImpl.invoke(DelegatingMethodAccessorImpl.java:43)
at java.lang.reflect.Method.invoke(Method.java:616)
at org.apache.maven.surefire.booter.SurefireBooter.runSuitesInProcess(SurefireBooter.java:350)
at org.apache.maven.surefire.booter.SurefireBooter.main(SurefireBooter.java:1021)

settingBitrateChangesCodecBitrate(org.opencastproject.capture.pipeline.bins.consumers.VideoFilesinkConsumerTest) Time elapsed: 0.005 sec <<< FAILURE!
java.lang.AssertionError:
at org.junit.Assert.fail(Assert.java:91)
at org.junit.Assert.fail(Assert.java:98)
at org.opencastproject.capture.pipeline.bins.consumers.VideoFilesinkConsumerTest.createVideoFileSinkBinDontWantException(VideoFilesinkConsumerTest.java:252)
at org.opencastproject.capture.pipeline.bins.consumers.VideoFilesinkConsumerTest.settingBitrateChangesCodecBitrate(VideoFilesinkConsumerTest.java:140)
at sun.reflect.NativeMethodAccessorImpl.invoke0(Native Method)
at sun.reflect.NativeMethodAccessorImpl.invoke(NativeMethodAccessorImpl.java:57)
at sun.reflect.DelegatingMethodAccessorImpl.invoke(DelegatingMethodAccessorImpl.java:43)
at java.lang.reflect.Method.invoke(Method.java:616)
at org.junit.runners.model.FrameworkMethod$1.runReflectiveCall(FrameworkMethod.java:44)
at org.junit.internal.runners.model.ReflectiveCallable.run(ReflectiveCallable.java:15)
at org.junit.runners.model.FrameworkMethod.invokeExplosively(FrameworkMethod.java:41)
at org.junit.internal.runners.statements.InvokeMethod.evaluate(InvokeMethod.java:20)
at org.junit.internal.runners.statements.RunBefores.evaluate(RunBefores.java:28)
at org.junit.internal.runners.statements.RunAfters.evaluate(RunAfters.java:31)
at org.junit.runners.BlockJUnit4ClassRunner.runChild(BlockJUnit4ClassRunner.java:73)
at org.junit.runners.BlockJUnit4ClassRunner.runChild(BlockJUnit4ClassRunner.java:46)
at org.junit.runners.ParentRunner.runChildren(ParentRunner.java:180)
at org.junit.runners.ParentRunner.access$000(ParentRunner.java:41)
at org.junit.runners.ParentRunner$1.evaluate(ParentRunner.java:173)
at org.junit.internal.runners.statements.RunBefores.evaluate(RunBefores.java:28)
at org.junit.internal.runners.statements.RunAfters.evaluate(RunAfters.java:31)
at org.junit.runners.ParentRunner.run(ParentRunner.java:220)
at org.apache.maven.surefire.junit4.JUnit4TestSet.execute(JUnit4TestSet.java:59)
at org.apache.maven.surefire.suite.AbstractDirectoryTestSuite.executeTestSet(AbstractDirectoryTestSuite.java:120)
at org.apache.maven.surefire.suite.AbstractDirectoryTestSuite.execute(AbstractDirectoryTestSuite.java:103)
at org.apache.maven.surefire.Surefire.run(Surefire.java:169)
at sun.reflect.NativeMethodAccessorImpl.invoke0(Native Method)
at sun.reflect.NativeMethodAccessorImpl.invoke(NativeMethodAccessorImpl.java:57)
at sun.reflect.DelegatingMethodAccessorImpl.invoke(DelegatingMethodAccessorImpl.java:43)
at java.lang.reflect.Method.invoke(Method.java:616)
at org.apache.maven.surefire.booter.SurefireBooter.runSuitesInProcess(SurefireBooter.java:350)
at org.apache.maven.surefire.booter.SurefireBooter.main(SurefireBooter.java:1021)

settingCodecButNotContainerResultsInCorrectCodecAndDefaultMuxer(org.opencastproject.capture.pipeline.bins.consumers.VideoFilesinkConsumerTest) Time elapsed: 0.005 sec <<< FAILURE!
java.lang.AssertionError:
at org.junit.Assert.fail(Assert.java:91)
at org.junit.Assert.fail(Assert.java:98)
at org.opencastproject.capture.pipeline.bins.consumers.VideoFilesinkConsumerTest.createVideoFileSinkBinDontWantException(VideoFilesinkConsumerTest.java:252)
at org.opencastproject.capture.pipeline.bins.consumers.VideoFilesinkConsumerTest.settingCodecButNotContainerResultsInCorrectCodecAndDefaultMuxer(VideoFilesinkConsumerTest.java:192)
at sun.reflect.NativeMethodAccessorImpl.invoke0(Native Method)
at sun.reflect.NativeMethodAccessorImpl.invoke(NativeMethodAccessorImpl.java:57)
at sun.reflect.DelegatingMethodAccessorImpl.invoke(DelegatingMethodAccessorImpl.java:43)
at java.lang.reflect.Method.invoke(Method.java:616)
at org.junit.runners.model.FrameworkMethod$1.runReflectiveCall(FrameworkMethod.java:44)
at org.junit.internal.runners.model.ReflectiveCallable.run(ReflectiveCallable.java:15)
at org.junit.runners.model.FrameworkMethod.invokeExplosively(FrameworkMethod.java:41)
at org.junit.internal.runners.statements.InvokeMethod.evaluate(InvokeMethod.java:20)
at org.junit.internal.runners.statements.RunBefores.evaluate(RunBefores.java:28)
at org.junit.internal.runners.statements.RunAfters.evaluate(RunAfters.java:31)
at org.junit.runners.BlockJUnit4ClassRunner.runChild(BlockJUnit4ClassRunner.java:73)
at org.junit.runners.BlockJUnit4ClassRunner.runChild(BlockJUnit4ClassRunner.java:46)
at org.junit.runners.ParentRunner.runChildren(ParentRunner.java:180)
at org.junit.runners.ParentRunner.access$000(ParentRunner.java:41)
at org.junit.runners.ParentRunner$1.evaluate(ParentRunner.java:173)
at org.junit.internal.runners.statements.RunBefores.evaluate(RunBefores.java:28)
at org.junit.internal.runners.statements.RunAfters.evaluate(RunAfters.java:31)
at org.junit.runners.ParentRunner.run(ParentRunner.java:220)
at org.apache.maven.surefire.junit4.JUnit4TestSet.execute(JUnit4TestSet.java:59)
at org.apache.maven.surefire.suite.AbstractDirectoryTestSuite.executeTestSet(AbstractDirectoryTestSuite.java:120)
at org.apache.maven.surefire.suite.AbstractDirectoryTestSuite.execute(AbstractDirectoryTestSuite.java:103)
at org.apache.maven.surefire.Surefire.run(Surefire.java:169)
at sun.reflect.NativeMethodAccessorImpl.invoke0(Native Method)
at sun.reflect.NativeMethodAccessorImpl.invoke(NativeMethodAccessorImpl.java:57)
at sun.reflect.DelegatingMethodAccessorImpl.invoke(DelegatingMethodAccessorImpl.java:43)
at java.lang.reflect.Method.invoke(Method.java:616)
at org.apache.maven.surefire.booter.SurefireBooter.runSuitesInProcess(SurefireBooter.java:350)
at org.apache.maven.surefire.booter.SurefireBooter.main(SurefireBooter.java:1021)

settingContainerResultsInCorrectMuxer(org.opencastproject.capture.pipeline.bins.consumers.VideoFilesinkConsumerTest) Time elapsed: 0.006 sec <<< FAILURE!
java.lang.AssertionError:
at org.junit.Assert.fail(Assert.java:91)
at org.junit.Assert.fail(Assert.java:98)
at org.opencastproject.capture.pipeline.bins.consumers.VideoFilesinkConsumerTest.createVideoFileSinkBinDontWantException(VideoFilesinkConsumerTest.java:252)
at org.opencastproject.capture.pipeline.bins.consumers.VideoFilesinkConsumerTest.settingContainerResultsInCorrectMuxer(VideoFilesinkConsumerTest.java:204)
at sun.reflect.NativeMethodAccessorImpl.invoke0(Native Method)
at sun.reflect.NativeMethodAccessorImpl.invoke(NativeMethodAccessorImpl.java:57)
at sun.reflect.DelegatingMethodAccessorImpl.invoke(DelegatingMethodAccessorImpl.java:43)
at java.lang.reflect.Method.invoke(Method.java:616)
at org.junit.runners.model.FrameworkMethod$1.runReflectiveCall(FrameworkMethod.java:44)
at org.junit.internal.runners.model.ReflectiveCallable.run(ReflectiveCallable.java:15)
at org.junit.runners.model.FrameworkMethod.invokeExplosively(FrameworkMethod.java:41)
at org.junit.internal.runners.statements.InvokeMethod.evaluate(InvokeMethod.java:20)
at org.junit.internal.runners.statements.RunBefores.evaluate(RunBefores.java:28)
at org.junit.internal.runners.statements.RunAfters.evaluate(RunAfters.java:31)
at org.junit.runners.BlockJUnit4ClassRunner.runChild(BlockJUnit4ClassRunner.java:73)
at org.junit.runners.BlockJUnit4ClassRunner.runChild(BlockJUnit4ClassRunner.java:46)
at org.junit.runners.ParentRunner.runChildren(ParentRunner.java:180)
at org.junit.runners.ParentRunner.access$000(ParentRunner.java:41)
at org.junit.runners.ParentRunner$1.evaluate(ParentRunner.java:173)
at org.junit.internal.runners.statements.RunBefores.evaluate(RunBefores.java:28)
at org.junit.internal.runners.statements.RunAfters.evaluate(RunAfters.java:31)
at org.junit.runners.ParentRunner.run(ParentRunner.java:220)
at org.apache.maven.surefire.junit4.JUnit4TestSet.execute(JUnit4TestSet.java:59)
at org.apache.maven.surefire.suite.AbstractDirectoryTestSuite.executeTestSet(AbstractDirectoryTestSuite.java:120)
at org.apache.maven.surefire.suite.AbstractDirectoryTestSuite.execute(AbstractDirectoryTestSuite.java:103)
at org.apache.maven.surefire.Surefire.run(Surefire.java:169)
at sun.reflect.NativeMethodAccessorImpl.invoke0(Native Method)
at sun.reflect.NativeMethodAccessorImpl.invoke(NativeMethodAccessorImpl.java:57)
at sun.reflect.DelegatingMethodAccessorImpl.invoke(DelegatingMethodAccessorImpl.java:43)
at java.lang.reflect.Method.invoke(Method.java:616)
at org.apache.maven.surefire.booter.SurefireBooter.runSuitesInProcess(SurefireBooter.java:350)
at org.apache.maven.surefire.booter.SurefireBooter.main(SurefireBooter.java:1021)

realFileLocationExampleSetsPropertyAndDoesntThrowException(org.opencastproject.capture.pipeline.bins.consumers.VideoFilesinkConsumerTest) Time elapsed: 0.006 sec <<< FAILURE!
java.lang.AssertionError:
at org.junit.Assert.fail(Assert.java:91)
at org.junit.Assert.fail(Assert.java:98)
at org.opencastproject.capture.pipeline.bins.consumers.VideoFilesinkConsumerTest.createVideoFileSinkBinDontWantException(VideoFilesinkConsumerTest.java:252)
at org.opencastproject.capture.pipeline.bins.consumers.VideoFilesinkConsumerTest.realFileLocationExampleSetsPropertyAndDoesntThrowException(VideoFilesinkConsumerTest.java:218)
at sun.reflect.NativeMethodAccessorImpl.invoke0(Native Method)
at sun.reflect.NativeMethodAccessorImpl.invoke(NativeMethodAccessorImpl.java:57)
at sun.reflect.DelegatingMethodAccessorImpl.invoke(DelegatingMethodAccessorImpl.java:43)
at java.lang.reflect.Method.invoke(Method.java:616)
at org.junit.runners.model.FrameworkMethod$1.runReflectiveCall(FrameworkMethod.java:44)
at org.junit.internal.runners.model.ReflectiveCallable.run(ReflectiveCallable.java:15)
at org.junit.runners.model.FrameworkMethod.invokeExplosively(FrameworkMethod.java:41)
at org.junit.internal.runners.statements.InvokeMethod.evaluate(InvokeMethod.java:20)
at org.junit.internal.runners.statements.RunBefores.evaluate(RunBefores.java:28)
at org.junit.internal.runners.statements.RunAfters.evaluate(RunAfters.java:31)
at org.junit.runners.BlockJUnit4ClassRunner.runChild(BlockJUnit4ClassRunner.java:73)
at org.junit.runners.BlockJUnit4ClassRunner.runChild(BlockJUnit4ClassRunner.java:46)
at org.junit.runners.ParentRunner.runChildren(ParentRunner.java:180)
at org.junit.runners.ParentRunner.access$000(ParentRunner.java:41)
at org.junit.runners.ParentRunner$1.evaluate(ParentRunner.java:173)
at org.junit.internal.runners.statements.RunBefores.evaluate(RunBefores.java:28)
at org.junit.internal.runners.statements.RunAfters.evaluate(RunAfters.java:31)
at org.junit.runners.ParentRunner.run(ParentRunner.java:220)
at org.apache.maven.surefire.junit4.JUnit4TestSet.execute(JUnit4TestSet.java:59)
at org.apache.maven.surefire.suite.AbstractDirectoryTestSuite.executeTestSet(AbstractDirectoryTestSuite.java:120)
at org.apache.maven.surefire.suite.AbstractDirectoryTestSuite.execute(AbstractDirectoryTestSuite.java:103)
at org.apache.maven.surefire.Surefire.run(Surefire.java:169)
at sun.reflect.NativeMethodAccessorImpl.invoke0(Native Method)
at sun.reflect.NativeMethodAccessorImpl.invoke(NativeMethodAccessorImpl.java:57)
at sun.reflect.DelegatingMethodAccessorImpl.invoke(DelegatingMethodAccessorImpl.java:43)
at java.lang.reflect.Method.invoke(Method.java:616)
at org.apache.maven.surefire.booter.SurefireBooter.runSuitesInProcess(SurefireBooter.java:350)
at org.apache.maven.surefire.booter.SurefireBooter.main(SurefireBooter.java:1021)

x264EncoderPropertiesCanBeSet(org.opencastproject.capture.pipeline.bins.consumers.VideoFilesinkConsumerTest) Time elapsed: 0.005 sec <<< ERROR!
java.lang.IllegalArgumentException: Unknown property: profile
at org.gstreamer.GObject.set(GObject.java:87)
at org.opencastproject.capture.pipeline.bins.consumers.VideoFilesinkConsumer.setEncoderProperty(VideoFilesinkConsumer.java:229)
at org.opencastproject.capture.pipeline.bins.consumers.VideoFilesinkConsumer.setEncoderProperty(VideoFilesinkConsumer.java:217)
at org.opencastproject.capture.pipeline.bins.consumers.VideoFilesinkConsumer.setX264EncoderProperties(VideoFilesinkConsumer.java:203)
at org.opencastproject.capture.pipeline.bins.consumers.VideoFilesinkConsumer.setEncoderProperties(VideoFilesinkConsumer.java:193)
at org.opencastproject.capture.pipeline.bins.consumers.VideoFilesinkConsumer.setElementProperties(VideoFilesinkConsumer.java:150)
at org.opencastproject.capture.pipeline.bins.PartialBin.<init>(PartialBin.java:65)
at org.opencastproject.capture.pipeline.bins.consumers.ConsumerBin.<init>(ConsumerBin.java:80)
at org.opencastproject.capture.pipeline.bins.consumers.VideoFilesinkConsumer.<init>(VideoFilesinkConsumer.java:70)
at org.opencastproject.capture.pipeline.bins.consumers.VideoFilesinkConsumerTest.x264EncoderPropertiesCanBeSet(VideoFilesinkConsumerTest.java:180)
at sun.reflect.NativeMethodAccessorImpl.invoke0(Native Method)
at sun.reflect.NativeMethodAccessorImpl.invoke(NativeMethodAccessorImpl.java:57)
at sun.reflect.DelegatingMethodAccessorImpl.invoke(DelegatingMethodAccessorImpl.java:43)
at java.lang.reflect.Method.invoke(Method.java:616)
at org.junit.runners.model.FrameworkMethod$1.runReflectiveCall(FrameworkMethod.java:44)
at org.junit.internal.runners.model.ReflectiveCallable.run(ReflectiveCallable.java:15)
at org.junit.runners.model.FrameworkMethod.invokeExplosively(FrameworkMethod.java:41)
at org.junit.internal.runners.statements.InvokeMethod.evaluate(InvokeMethod.java:20)
at org.junit.internal.runners.statements.RunBefores.evaluate(RunBefores.java:28)
at org.junit.internal.runners.statements.RunAfters.evaluate(RunAfters.java:31)
at org.junit.runners.BlockJUnit4ClassRunner.runChild(BlockJUnit4ClassRunner.java:73)
at org.junit.runners.BlockJUnit4ClassRunner.runChild(BlockJUnit4ClassRunner.java:46)
at org.junit.runners.ParentRunner.runChildren(ParentRunner.java:180)
at org.junit.runners.ParentRunner.access$000(ParentRunner.java:41)
at org.junit.runners.ParentRunner$1.evaluate(ParentRunner.java:173)
at org.junit.internal.runners.statements.RunBefores.evaluate(RunBefores.java:28)
at org.junit.internal.runners.statements.RunAfters.evaluate(RunAfters.java:31)
at org.junit.runners.ParentRunner.run(ParentRunner.java:220)
at org.apache.maven.surefire.junit4.JUnit4TestSet.execute(JUnit4TestSet.java:59)
at org.apache.maven.surefire.suite.AbstractDirectoryTestSuite.executeTestSet(AbstractDirectoryTestSuite.java:120)
at org.apache.maven.surefire.suite.AbstractDirectoryTestSuite.execute(AbstractDirectoryTestSuite.java:103)
at org.apache.maven.surefire.Surefire.run(Surefire.java:169)
at sun.reflect.NativeMethodAccessorImpl.invoke0(Native Method)
at sun.reflect.NativeMethodAccessorImpl.invoke(NativeMethodAccessorImpl.java:57)
at sun.reflect.DelegatingMethodAccessorImpl.invoke(DelegatingMethodAccessorImpl.java:43)
at java.lang.reflect.Method.invoke(Method.java:616)
at org.apache.maven.surefire.booter.SurefireBooter.runSuitesInProcess(SurefireBooter.java:350)
at org.apache.maven.surefire.booter.SurefireBooter.main(SurefireBooter.java:1021)

Running org.opencastproject.capture.impl.jobs.CleanCaptureJobTest
Tests run: 4, Failures: 0, Errors: 0, Skipped: 0, Time elapsed: 0.059 sec
Running org.opencastproject.capture.impl.jobs.StartCaptureJobTest
Tests run: 3, Failures: 0, Errors: 0, Skipped: 0, Time elapsed: 0.025 sec
Running org.opencastproject.capture.impl.RecordingImplTest
Tests run: 5, Failures: 0, Errors: 0, Skipped: 0, Time elapsed: 0.012 sec
Running org.opencastproject.capture.impl.SchedulerImplTest
Starting testValidRemoteUTF8Calendar
Ending testValidRemoteUTF8Calendar
Tests run: 34, Failures: 0, Errors: 0, Skipped: 3, Time elapsed: 1.126 sec
Running org.opencastproject.capture.pipeline.bins.producers.CustomAudioProducerTest

(unknown:19048): GStreamer-CRITICAL **: gst_parse_bin_from_description_full: assertion `bin_description != NULL' failed
Tests run: 4, Failures: 0, Errors: 0, Skipped: 0, Time elapsed: 0.005 sec
Running org.opencastproject.capture.impl.jobs.SchedulingTest
Tests run: 1, Failures: 0, Errors: 0, Skipped: 1, Time elapsed: 0.001 sec
Running org.opencastproject.capture.pipeline.CaptureDeviceTest
[FILE, source: destination]
Tests run: 1, Failures: 0, Errors: 0, Skipped: 0, Time elapsed: 0.002 sec

Results :

Failed tests:
testHostPortProperties(org.opencastproject.capture.pipeline.bins.consumers.RTPSinkConsumerTest)
testAudioEncoderProperties(org.opencastproject.capture.pipeline.bins.consumers.RTPSinkConsumerTest)
testCustomAudioEncoder(org.opencastproject.capture.pipeline.bins.consumers.RTPSinkConsumerTest)
testVideoEncoderProperties(org.opencastproject.capture.pipeline.bins.consumers.RTPSinkConsumerTest)
testVideoFramerate(org.opencastproject.capture.pipeline.bins.consumers.RTPSinkConsumerTest)
nullSettingsForCodecBitrateAndContainerCreatesElementsWithDefaults(org.opencastproject.capture.pipeline.bins.consumers.VideoFilesinkConsumerTest)
settingBitrateChangesCodecBitrate(org.opencastproject.capture.pipeline.bins.consumers.VideoFilesinkConsumerTest)
settingCodecButNotContainerResultsInCorrectCodecAndDefaultMuxer(org.opencastproject.capture.pipeline.bins.consumers.VideoFilesinkConsumerTest)
settingContainerResultsInCorrectMuxer(org.opencastproject.capture.pipeline.bins.consumers.VideoFilesinkConsumerTest)
realFileLocationExampleSetsPropertyAndDoesntThrowException(org.opencastproject.capture.pipeline.bins.consumers.VideoFilesinkConsumerTest)

Tests in error:
testVideoFileSink(org.opencastproject.capture.pipeline.bins.consumers.ConsumerFactoryTest)
x264EncoderPropertiesCanBeSet(org.opencastproject.capture.pipeline.bins.consumers.VideoFilesinkConsumerTest)

Tests run: 149, Failures: 10, Errors: 2, Skipped: 20

Exception in thread "TrueZIP ArchiveController Shutdown Hook" java.lang.AssertionError
at de.schlichtherle.io.UpdatingArchiveController.umount0(UpdatingArchiveController.java:673)
at de.schlichtherle.io.UpdatingArchiveController.umount(UpdatingArchiveController.java:594)
at de.schlichtherle.io.ArchiveControllers.umount(ArchiveControllers.java:307)
at de.schlichtherle.io.ArchiveControllers$ShutdownHook.run(ArchiveControllers.java:411)
[INFO] ------------------------------------------------------------------------
[ERROR] BUILD FAILURE
[INFO] ------------------------------------------------------------------------
[INFO] There are test failures.

Please refer to /opt/matterhorn/felix/modules/matterhorn-capture-agent-impl/target/surefire-reports for the individual test results.
[INFO] ------------------------------------------------------------------------
[INFO] For more information, run Maven with the -e switch
[INFO] ------------------------------------------------------------------------
[INFO] Total time: 1 minute 41 seconds
[INFO] Finished at: Tue Dec 04 14:01:31 PST 2012
[INFO] Final Memory: 116M/459M
[INFO] ------------------------------------------------------------------------

Error building the matterhorn code. What do you wish to do?:
1) Download another source
2) Retry build
3) Exit

Status

Assignee

Greg Logan

Reporter

Jonathan Felder

Severity

Non Functioning

Tags (folksonomy)

None

Components

Affects versions

1.4.0

Priority

Major
Configure